{"text_format":"1","workbook":"xlsx","n_sheets":6,"sheets":["Romania Map","Model","Control","Data","Peaks","About"],"not_rendered":{"charts":2,"images":0,"macros":1,"external_links":0,"defined_names":118,"comments":1,"pivot_tables":0},"unopened":[],"bounds":{"document_bytes":16777216,"sheet_cells":100000,"rows_first":2000,"rows_last":500,"rows_between":2000,"halvings":0,"cell_chars":16384,"cell_head_chars":4096},"cells_cut":0,"cells_raw":0,"read":"whole","date_system":"1900"}

{"sheet":"Romania Map","index":0,"n_rows":37,"n_cols":17,"rows_kept":37,"cut":false,"hidden":false,"merged":[[5,15,5,16]]}
[]
[null,"Thematic Map of Romania"]
[]
[]
[]
[null,null,null,null,null,null,null,null,null,null,null,null,"Relative Importance",null,null,"Weight"]
[null,null,null,null,null,null,null,null,null,null,null,null,null,null,null,"Raw","Normalized"]
[null,null,null,null,null,null,null,null,null,null,null,null,"Contains Major Airport"]
[null,null,null,null,null,null,null,null,null,null,null,null,null,null,null,24,{"$f":"P9/SUM($P$9:$P$18)","v":0.13043478260869565}]
[]
[null,null,null,null,null,null,null,null,null,null,null,null,"No. of Mountain Peaks"]
[null,null,null,null,null,null,null,null,null,null,null,null,null,null,null,65,{"$f":"P12/SUM($P$9:$P$18)","v":0.35326086956521741}]
[]
[null,null,null,null,null,null,null,null,null,null,null,null,"Population Density"]
[null,null,null,null,null,null,null,null,null,null,null,null,null,null,null,57,{"$f":"P15/SUM($P$9:$P$18)","v":0.30978260869565216}]
[]
[null,null,null,null,null,null,null,null,null,null,null,null,"Elevation"]
[null,null,null,null,null,null,null,null,null,null,null,null,null,null,null,38,{"$f":"P18/SUM($P$9:$P$18)","v":0.20652173913043478}]
[]
[null,null,null,null,null,null,null,null,null,null,null,null,null,null,null,null,{"$f":"SUM(Q9:Q18)","v":1}]
[]
[]
[null,null,null,null,null,null,null,null,null,null,null,null,"Top Five Locations",null,null,"MAUT Results"]
[null,null,null,null,null,null,null,null,null,null,null,null,1,null,{"$f":"Model!P10","v":"Caraș-Severin"},null,{"$f":"Model!Q10","v":0.84653373949967692}]
[null,null,null,null,null,null,null,null,null,null,null,null,2,null,{"$f":"Model!P11","v":"Mureș"},null,{"$f":"Model!Q11","v":0.83984699529216289}]
[null,null,null,null,null,null,null,null,null,null,null,null,3,null,{"$f":"Model!P12","v":"Călărași"},null,{"$f":"Model!Q12","v":0.83850964645066006}]
[null,null,null,null,null,null,null,null,null,null,null,null,4,null,{"$f":"Model!P13","v":"Maramureș"},null,{"$f":"Model!Q13","v":0.77090833564109662}]
[null,null,null,null,null,null,null,null,null,null,null,null,5,null,{"$f":"Model!P14","v":"Bistrița-Năsăud"},null,{"$f":"Model!Q14","v":0.76229230130157843}]
[]
[]
[]
[]
[]
[]
[]
[]
[null,0.24506202978317321,null,null,null,null,null,null,null,null,0.89854869037960861]

{"sheet":"Model","index":1,"n_rows":95,"n_cols":18,"rows_kept":95,"cut":false,"hidden":false,"merged":[[8,13,8,16],[52,10,52,11]]}
[]
[null,"Model"]
[]
[null,"Range Maximum",null,null,{"$f":"MAX(E10:E50)","v":1},null,{"$f":"MAX(G10:G50)","v":7},null,{"$f":"MAX(I10:I50)","v":188},null,{"$f":"MAX(K10:K50)","v":6}]
[null,"Range Minimum",null,null,{"$f":"MIN(E10:E50)","v":0},null,{"$f":"MIN(G10:G50)","v":0},null,{"$f":"MIN(I10:I50)","v":31},null,{"$f":"MIN(K10:K50)","v":0}]
[null,"Weight",null,null,{"$f":"AirportW","v":0.13043478260869565},null,{"$f":"PeaksW","v":0.35326086956521741},null,{"$f":"PopW","v":0.30978260869565216},null,{"$f":"EnvW","v":0.20652173913043478}]
[null,"Range",null,null,{"$f":"MaxA-MinA","v":1},null,{"$f":"MaxP-MinP","v":7},null,{"$f":"MaxPD-MinPD","v":157},null,{"$f":"MaxE-MinE","v":6}]
[]
[null,"No.","State","Abbreviation","Airport",null,"High Peaks",null,"Population Density",null,"Elevation",null,"MAUT","Ideal Location"]
[null,1,"Alba","AB",{"$f":"Data!E5","v":0},{"$f":"((E10-MinA)/(MaxA-MinA))*$E$6","v":0},{"$f":"Data!F5","v":5},{"$f":"((MaxP-G10)/(MaxP-MinP))*$G$6","v":0.10093167701863354},{"$f":"Data!G5","v":61},{"$f":"((MaxPD-I10)/(MaxPD-MinPD))*$I$6","v":0.25058847964552755},{"$f":"(Data!H5)","v":3.5},{"$f":"((K10-MinE)/(MaxE-MinE))*$K$6","v":0.12047101449275363},{"$f":"SUM(F10,H10,J10,L10)","v":0.47199117115691469},null,1,{"$f":"INDEX($C$10:$C$50, MATCH(Q10,Maut,FALSE),1)","v":"Caraș-Severin"},{"$f":"MAX(Maut)","v":0.84653373949967692}]
[null,{"$f":"B10+1","v":2},"Arad","AR",{"$f":"Data!E6","v":1},0.13043478260869565,{"$f":"Data!F6","v":2},0.25232919254658387,{"$f":"Data!G6","v":59.5},0.25354818609803381,{"$f":"(Data!H6)","v":2.5},8.6050724637681167E-2,{"$f":"SUM(F11,H11,J11,L11)","v":0.72236288589099451},null,2,{"$f":"INDEX($C$10:$C$50, MATCH(Q11,Maut,FALSE),1)","v":"Mureș"},{"$f":"LARGE(Maut,2)","v":0.83984699529216289}]
[null,3,"Argeș","AG",{"$f":"Data!E7","v":0},0,{"$f":"Data!F7","v":0},0.35326086956521741,{"$f":"Data!G7","v":95},0.1835018000553863,{"$f":"(Data!H7)","v":3},0.10326086956521739,0.64002353918582111,null,3,{"$f":"INDEX($C$10:$C$50, MATCH(Q12,Maut,FALSE),1)","v":"Călărași"},{"$f":"LARGE(Maut,3)","v":0.83850964645066006}]
[null,4,"Bacău","BC",{"$f":"Data!E8","v":0},0,{"$f":"Data!F8","v":2},0.25232919254658387,{"$f":"Data!G8","v":113},0.14798532262531156,{"$f":"(Data!H8)","v":3.2},0.11014492753623188,0.51045944270812726,null,4,{"$f":"INDEX($C$10:$C$50, MATCH(Q13,Maut,FALSE),1)","v":"Maramureș"},{"$f":"LARGE(Maut,4)","v":0.77090833564109662}]
[null,5,"Bihor","BH",{"$f":"Data!E9","v":1},0.13043478260869565,{"$f":"Data!F9","v":2},0.25232919254658387,{"$f":"Data!G9","v":84},0.20520631404043199,{"$f":"(Data!H9)","v":1.5},5.1630434782608696E-2,0.63960072397832013,null,5,{"$f":"INDEX($C$10:$C$50, MATCH(Q14,Maut,FALSE),1)","v":"Bistrița-Năsăud"},{"$f":"LARGE(Maut,5)","v":0.76229230130157843}]
[null,6,"Bistrița-Năsăud","BN",{"$f":"Data!E10","v":0},0,{"$f":"Data!F10","v":0},0.35326086956521741,{"$f":"Data!G10","v":59.2},0.25414012738853503,{"$f":"(Data!H10)","v":4.5},0.15489130434782608,0.76229230130157843]
[null,7,"Botoșani","BT",{"$f":"Data!E11","v":0},0,{"$f":"Data!F11","v":0},0.35326086956521741,{"$f":"Data!G11","v":91},0.19139435059540291,{"$f":"(Data!H11)","v":0},0,0.54465522016062029]
[null,8,"Brăila","BR",{"$f":"Data!E12","v":1},0.13043478260869565,{"$f":"Data!F12","v":0},0.35326086956521741,{"$f":"Data!G12","v":78},0.21704513985045693,{"$f":"(Data!H12)","v":0},0,0.70074079202437001,null,null,null,null,"."]
[null,9,"Brașov","BV",{"$f":"Data!E13","v":0},0,{"$f":"Data!F13","v":0},0.35326086956521741,{"$f":"Data!G13","v":111.2},0.15153697036831901,{"$f":"(Data!H13)","v":2.5},8.6050724637681167E-2,0.59084856457121759]
[null,10,"Buzău","BZ",{"$f":"Data!E14","v":1},0.13043478260869565,{"$f":"Data!F14","v":2},0.25232919254658387,{"$f":"Data!G14","v":81},0.21112572694544446,{"$f":"(Data!H14)","v":2},6.8840579710144928E-2,0.66273028181086879]
[null,11,"Călărași","CL",{"$f":"Data!E15","v":1},0.13043478260869565,{"$f":"Data!F15","v":0},0.35326086956521741,{"$f":"Data!G15","v":64},0.24466906674051508,{"$f":"(Data!H15)","v":3.2},0.11014492753623188,0.83850964645066006]
[null,12,"Caraș-Severin","CS",{"$f":"Data!E16","v":1},0.13043478260869565,{"$f":"Data!F16","v":0},0.35326086956521741,{"$f":"Data!G16","v":39},0.29399750761561894,{"$f":"(Data!H16)","v":2},6.8840579710144928E-2,0.84653373949967692]
[null,13,"Cluj","CJ",{"$f":"Data!E17","v":1},0.13043478260869565,{"$f":"Data!F17","v":2},0.25232919254658387,{"$f":"Data!G17","v":105},0.16377042370534478,{"$f":"(Data!H17)","v":4.5},0.15489130434782608,0.70142570320845032]
[null,14,"Constanța","CT",{"$f":"Data!E18","v":1},0.13043478260869565,{"$f":"Data!F18","v":0},0.35326086956521741,{"$f":"Data!G18","v":101},0.17166297424536139,{"$f":"(Data!H18)","v":0},0,0.65535862641927445]
[null,15,"Covasna","CV",{"$f":"Data!E19","v":0},0,{"$f":"Data!F19","v":2},0.25232919254658387,{"$f":"Data!G19","v":60},0.25256161728053172,{"$f":"(Data!H19)","v":3.4},0.11702898550724637,0.62191979533436204]
[null,16,"Dâmbovița","DB",{"$f":"Data!E20","v":0},0,{"$f":"Data!F20","v":0},0.35326086956521741,{"$f":"Data!G20","v":134},0.1065494322902243,{"$f":"(Data!H20)","v":1.3},4.4746376811594206E-2,0.50455667866703591]
[null,17,"Dolj","DJ",{"$f":"Data!E21","v":1},0.13043478260869565,{"$f":"Data!F21","v":0},0.35326086956521741,{"$f":"Data!G21","v":99},0.17560924951536969,{"$f":"(Data!H21)","v":0},0,0.6593049016892828]
[null,18,"Galați","GL",{"$f":"Data!E22","v":0},0,{"$f":"Data!F22","v":0},0.35326086956521741,{"$f":"Data!G22","v":139},9.6683744115203543E-2,{"$f":"(Data!H22)","v":1.2},4.1304347826086954E-2,0.49124896150650788]
[null,19,"Giurgiu","GR",{"$f":"Data!E23","v":0},0,{"$f":"Data!F23","v":0},0.35326086956521741,{"$f":"Data!G23","v":84},0.20520631404043199,{"$f":"(Data!H23)","v":0},0,0.5584671836056494]
[null,20,"Gorj","GJ",{"$f":"Data!E24","v":0},0,{"$f":"Data!F24","v":2},0.25232919254658387,{"$f":"Data!G24","v":69},0.23480337856549433,{"$f":"(Data!H24)","v":0},0,0.48713257111207819]
[null,21,"Harghita","HR",{"$f":"Data!E25","v":0},0,{"$f":"Data!F25","v":4},0.1513975155279503,{"$f":"Data!G25","v":52},0.26834671836056495,{"$f":"(Data!H25)","v":4.5},0.15489130434782608,0.57463553823634128]
[null,22,"Hunedoara","HD",{"$f":"Data!E26","v":0},0,{"$f":"Data!F26","v":7},0,{"$f":"Data!G26","v":69},0.23480337856549433,{"$f":"(Data!H26)","v":4},0.13768115942028986,0.37248453798578418]
[null,23,"Ialomița","IL",{"$f":"Data!E27","v":0},0,{"$f":"Data!F27","v":0},0.35326086956521741,{"$f":"Data!G27","v":67},0.23874965383550265,{"$f":"(Data!H27)","v":0},0,0.59201052340072002]
[null,24,"Iași","IS",{"$f":"Data!E28","v":1},0.13043478260869565,{"$f":"Data!F28","v":0},0.35326086956521741,{"$f":"Data!G28","v":150},7.4979230130157851E-2,{"$f":"(Data!H28)","v":1.2},4.1304347826086954E-2,0.59997923013015786]
[null,25,"Ilfov","IF",{"$f":"Data!E29","v":1},0.13043478260869565,{"$f":"Data!F29","v":0},0.35326086956521741,{"$f":"Data!G29","v":188},0,{"$f":"(Data!H29)","v":0},0,0.48369565217391308]
[null,26,"Maramureș","MM",{"$f":"Data!E30","v":0},0,{"$f":"Data!F30","v":0},0.35326086956521741,{"$f":"Data!G30","v":81},0.21112572694544446,{"$f":"(Data!H30)","v":6},0.20652173913043478,0.77090833564109662]
[null,27,"Mehedinți","MH",{"$f":"Data!E31","v":0},0,{"$f":"Data!F31","v":0},0.35326086956521741,{"$f":"Data!G31","v":62},0.2486153420105234,{"$f":"(Data!H31)","v":1.7},5.8514492753623186E-2,0.66039070432936398]
[null,28,"Mureș","MS",{"$f":"Data!E32","v":1},0.13043478260869565,{"$f":"Data!F32","v":0},0.35326086956521741,{"$f":"Data!G32","v":86},0.2012600387704237,{"$f":"(Data!H32)","v":4.5},0.15489130434782608,0.83984699529216289]
[null,29,"Neamț","NT",{"$f":"Data!E33","v":0},0,{"$f":"Data!F33","v":0},0.35326086956521741,{"$f":"Data!G33","v":99},0.17560924951536969,{"$f":"(Data!H33)","v":4.3},0.14800724637681159,0.67687736545739874]
[null,30,"Olt","OT",{"$f":"Data!E34","v":1},0.13043478260869565,{"$f":"Data!F34","v":0},0.35326086956521741,{"$f":"Data!G34","v":89},0.19534062586541123,{"$f":"(Data!H34)","v":1.2},4.1304347826086954E-2,0.72034062586541125]
[null,31,"Prahova","PH",{"$f":"Data!E35","v":0},0,{"$f":"Data!F35","v":2},0.25232919254658387,{"$f":"Data!G35","v":176},2.3677651620049846E-2,{"$f":"(Data!H35)","v":1.5},5.1630434782608696E-2,0.32763727894924244]
{"$rows_left_out":56}
{"sheet":"Control","index":2,"n_rows":107,"n_cols":7,"rows_kept":107,"cut":false,"hidden":false,"merged":[]}
[]
[null,null,"Control"]
[]
[null,null,"List of metrics","Contains Major Airport",null,null,"Show Names"]
[null,null,null,"Number of High Peaks",null,null,true]
[null,null,null,"Population Density"]
[null,null,null,"Average Elevation",null,null,"Fixed Weights"]
[null,null,null,"MAUT - Utility Model Results",null,null,true]
[]
[null,null,"Selection",5]
[]
[null,null,"Darkness",5,"The smaller the darker (max: 5.21)"]
[]
[null,null,"Steps","Threshold","RGB","Legend Name","Min / Max"]
[null,null,{"$f":"C16+$D$12","v":245},{"$f":"G16","v":0.32763727894924244},{"$f":"udf_RGB(C15,C15,C15)","v":16119285},{"$f":"CONCATENATE(\"Step_\",C15)","v":"Step_245"},{"$f":"MAX(Data!$K$5:$K$45)","v":0.84653373949967692}]
[null,null,240,{"$f":"D15+$G$17","v":0.33844762187737648},{"$f":"udf_RGB(C16,C16,C16)","v":15790320},"Step_240",{"$f":"MIN(Data!$K$5:$K$45)","v":0.32763727894924244}]
[null,null,235,0.34925796480551052,15461355,"Step_235",{"$f":"(G15-G16)/(COUNT($C$15:$C$64)-2)","v":1.0810342928134051E-2}]
[null,null,230,0.36006830773364457,15132390,"Step_230"]
[null,null,225,0.37087865066177861,14803425,"Step_225"]
[null,null,220,0.38168899358991265,14474460,"Step_220"]
[null,null,215,0.39249933651804669,14145495,"Step_215"]
[null,null,210,0.40330967944618074,13816530,"Step_210"]
[null,null,205,0.41412002237431478,13487565,"Step_205"]
[null,null,200,0.42493036530244882,13158600,"Step_200"]
[null,null,195,0.43574070823058286,12829635,"Step_195"]
[null,null,190,0.44655105115871691,12500670,"Step_190"]
[null,null,185,0.45736139408685095,12171705,"Step_185"]
[null,null,180,0.46817173701498499,11842740,"Step_180"]
[null,null,175,0.47898207994311903,11513775,"Step_175"]
[null,null,170,0.48979242287125307,11184810,"Step_170"]
[null,null,165,0.50060276579938712,10855845,"Step_165"]
[null,null,160,0.51141310872752122,10526880,"Step_160"]
[null,null,155,0.52222345165565531,10197915,"Step_155"]
[null,null,150,0.53303379458378941,9868950,"Step_150"]
[null,null,145,0.54384413751192351,9539985,"Step_145"]
[null,null,140,0.55465448044005761,9211020,"Step_140"]
[null,null,135,0.5654648233681917,8882055,"Step_135"]
[null,null,130,0.5762751662963258,8553090,"Step_130"]
[null,null,125,0.5870855092244599,8224125,"Step_125"]
[null,null,120,0.597895852152594,7895160,"Step_120"]
{"$rows_left_out":68}
{"sheet":"Data","index":3,"n_rows":45,"n_cols":11,"rows_kept":45,"cut":false,"hidden":false,"merged":[]}
[]
[null,"Data"]
[]
[null,"No.","State","Abbreviation","Airport","High Peaks","Population Density","Est. Elevation","MAUT",null,"Selection"]
[null,1,"Alba","AB",0,5,61,3.5,{"$f":"Model!M10","v":0.47199117115691469},null,{"$f":"INDEX(E5:I5,1,Control!$D$10)","v":0.47199117115691469}]
[null,{"$f":"B5+1","v":2},"Arad","AR",1,2,59.5,2.5,{"$f":"Model!M11","v":0.72236288589099451},null,{"$f":"INDEX(E6:I6,1,Control!$D$10)","v":0.72236288589099451}]
[null,3,"Argeș","AG",0,0,95,3,{"$f":"Model!M12","v":0.64002353918582111},null,{"$f":"INDEX(E7:I7,1,Control!$D$10)","v":0.64002353918582111}]
[null,4,"Bacău","BC",0,2,113,3.2,{"$f":"Model!M13","v":0.51045944270812726},null,{"$f":"INDEX(E8:I8,1,Control!$D$10)","v":0.51045944270812726}]
[null,5,"Bihor","BH",1,2,84,1.5,{"$f":"Model!M14","v":0.63960072397832013},null,{"$f":"INDEX(E9:I9,1,Control!$D$10)","v":0.63960072397832013}]
[null,6,"Bistrița-Năsăud","BN",0,0,59.2,4.5,{"$f":"Model!M15","v":0.76229230130157843},null,{"$f":"INDEX(E10:I10,1,Control!$D$10)","v":0.76229230130157843}]
[null,7,"Botoșani","BT",0,0,91,0,{"$f":"Model!M16","v":0.54465522016062029},null,{"$f":"INDEX(E11:I11,1,Control!$D$10)","v":0.54465522016062029}]
[null,8,"Brăila","BR",1,0,78,0,{"$f":"Model!M17","v":0.70074079202437001},null,{"$f":"INDEX(E12:I12,1,Control!$D$10)","v":0.70074079202437001}]
[null,9,"Brașov","BV",0,0,111.2,2.5,{"$f":"Model!M18","v":0.59084856457121759},null,{"$f":"INDEX(E13:I13,1,Control!$D$10)","v":0.59084856457121759}]
[null,10,"Buzău","BZ",1,2,81,2,{"$f":"Model!M19","v":0.66273028181086879},null,{"$f":"INDEX(E14:I14,1,Control!$D$10)","v":0.66273028181086879}]
[null,11,"Călărași","CL",1,0,64,3.2,{"$f":"Model!M20","v":0.83850964645066006},null,{"$f":"INDEX(E15:I15,1,Control!$D$10)","v":0.83850964645066006}]
[null,12,"Caraș-Severin","CS",1,0,39,2,{"$f":"Model!M21","v":0.84653373949967692},null,{"$f":"INDEX(E16:I16,1,Control!$D$10)","v":0.84653373949967692}]
[null,13,"Cluj","CJ",1,2,105,4.5,{"$f":"Model!M22","v":0.70142570320845032},null,{"$f":"INDEX(E17:I17,1,Control!$D$10)","v":0.70142570320845032}]
[null,14,"Constanța","CT",1,0,101,0,{"$f":"Model!M23","v":0.65535862641927445},null,{"$f":"INDEX(E18:I18,1,Control!$D$10)","v":0.65535862641927445}]
[null,15,"Covasna","CV",0,2,60,3.4,{"$f":"Model!M24","v":0.62191979533436204},null,{"$f":"INDEX(E19:I19,1,Control!$D$10)","v":0.62191979533436204}]
[null,16,"Dâmbovița","DB",0,0,134,1.3,{"$f":"Model!M25","v":0.50455667866703591},null,{"$f":"INDEX(E20:I20,1,Control!$D$10)","v":0.50455667866703591}]
[null,17,"Dolj","DJ",1,0,99,0,{"$f":"Model!M26","v":0.6593049016892828},null,{"$f":"INDEX(E21:I21,1,Control!$D$10)","v":0.6593049016892828}]
[null,18,"Galați","GL",0,0,139,1.2,{"$f":"Model!M27","v":0.49124896150650788},null,{"$f":"INDEX(E22:I22,1,Control!$D$10)","v":0.49124896150650788}]
[null,19,"Giurgiu","GR",0,0,84,0,{"$f":"Model!M28","v":0.5584671836056494},null,{"$f":"INDEX(E23:I23,1,Control!$D$10)","v":0.5584671836056494}]
[null,20,"Gorj","GJ",0,2,69,0,{"$f":"Model!M29","v":0.48713257111207819},null,{"$f":"INDEX(E24:I24,1,Control!$D$10)","v":0.48713257111207819}]
[null,21,"Harghita","HR",0,4,52,4.5,{"$f":"Model!M30","v":0.57463553823634128},null,{"$f":"INDEX(E25:I25,1,Control!$D$10)","v":0.57463553823634128}]
[null,22,"Hunedoara","HD",0,7,69,4,{"$f":"Model!M31","v":0.37248453798578418},null,{"$f":"INDEX(E26:I26,1,Control!$D$10)","v":0.37248453798578418}]
[null,23,"Ialomița","IL",0,0,67,0,{"$f":"Model!M32","v":0.59201052340072002},null,{"$f":"INDEX(E27:I27,1,Control!$D$10)","v":0.59201052340072002}]
[null,24,"Iași","IS",1,0,150,1.2,{"$f":"Model!M33","v":0.59997923013015786},null,{"$f":"INDEX(E28:I28,1,Control!$D$10)","v":0.59997923013015786}]
[null,25,"Ilfov","IF",1,0,188,0,{"$f":"Model!M34","v":0.48369565217391308},null,{"$f":"INDEX(E29:I29,1,Control!$D$10)","v":0.48369565217391308}]
[null,26,"Maramureș","MM",0,0,81,6,{"$f":"Model!M35","v":0.77090833564109662},null,{"$f":"INDEX(E30:I30,1,Control!$D$10)","v":0.77090833564109662}]
[null,27,"Mehedinți","MH",0,0,62,1.7,{"$f":"Model!M36","v":0.66039070432936398},null,{"$f":"INDEX(E31:I31,1,Control!$D$10)","v":0.66039070432936398}]
[null,28,"Mureș","MS",1,0,86,4.5,{"$f":"Model!M37","v":0.83984699529216289},null,{"$f":"INDEX(E32:I32,1,Control!$D$10)","v":0.83984699529216289}]
[null,29,"Neamț","NT",0,0,99,4.3,{"$f":"Model!M38","v":0.67687736545739874},null,{"$f":"INDEX(E33:I33,1,Control!$D$10)","v":0.67687736545739874}]
[null,30,"Olt","OT",1,0,89,1.2,{"$f":"Model!M39","v":0.72034062586541125},null,{"$f":"INDEX(E34:I34,1,Control!$D$10)","v":0.72034062586541125}]
[null,31,"Prahova","PH",0,2,176,1.5,{"$f":"Model!M40","v":0.32763727894924244},null,{"$f":"INDEX(E35:I35,1,Control!$D$10)","v":0.32763727894924244}]
[null,32,"Sălaj","SJ",0,1,64,2,{"$f":"Model!M41","v":0.61630467750656059},null,{"$f":"INDEX(E36:I36,1,Control!$D$10)","v":0.61630467750656059}]
[null,33,"Satu-Mare","SM",0,0,83,1.2,{"$f":"Model!M42","v":0.60174466906674051},null,{"$f":"INDEX(E37:I37,1,Control!$D$10)","v":0.60174466906674051}]
[null,34,"Sibiu","SB",1,4,78,5.5,{"$f":"Model!M43","v":0.68818903219000138},null,{"$f":"INDEX(E38:I38,1,Control!$D$10)","v":0.68818903219000138}]
[null,35,"Suceava","SV",1,7,80,2.7,{"$f":"Model!M44","v":0.4364684297978399},null,{"$f":"INDEX(E39:I39,1,Control!$D$10)","v":0.4364684297978399}]
[null,36,"Teleorman","TR",0,0,75,1.1000000000000001,{"$f":"Model!M45","v":0.61408774116126641},null,{"$f":"INDEX(E40:I40,1,Control!$D$10)","v":0.61408774116126641}]
{"$rows_left_out":6}
{"sheet":"Peaks","index":4,"n_rows":93,"n_cols":5,"rows_kept":93,"cut":false,"hidden":false,"merged":[]}
[]
["Altitude","Mountain Peaks"]
[]
[null,"County"," Height (m)","County","No. Peaks"]
[null,"Alba",1826,"Alba",{"$f":"COUNTIF(County,D5)","v":5}]
[null,"Alba",1437,"Arad",2]
[null,"Alba",1258,"Argeş",5]
[null,"Alba",1849,"Bacău",2]
[null,"Alba",1369,"Bihor",2]
[null,"Arad",1112,"Bistriţa-Năsăud",2]
[null,"Arad",836,"Braşov",5]
[null,"Argeş",2535,"Buzău",2]
[null,"Argeş",2391,"Caraş-Severin",9]
[null,"Argeş",2133,"Cluj",2]
[null,"Argeş",2544,"Covasna",2]
[null,"Argeş",2462,"Dâmboviţa",2]
[null,"Bacău",1649,"Gorj",2]
[null,"Bacău",1664,"Harghita",4]
[null,"Bihor",1849,"Hunedoara",7]
[null,"Bihor",1112,"Maramureş",6]
[null,"Bistriţa-Năsăud",2279,"Mehedinţi",1]
[null,"Bistriţa-Năsăud",1837,"Mureş",2]
[null,"Braşov",2535,"Neamţ",5]
[null,"Braşov",2505,"Prahova",2]
[null,"Braşov",1954,"Sălaj",1]
[null,"Braşov",1104,"Sibiu",4]
[null,"Braşov",2238,"Suceava",7]
[null,"Buzău",1784,"Timiş",1]
[null,"Buzău",1772,"Tulcea",1]
[null,"Caraş-Severin",2291,"Vâlcea",4]
[null,"Caraş-Severin",2229,"Vrancea",2]
[null,"Caraş-Severin",2190]
[null,"Caraş-Severin",1733]
[null,"Caraş-Severin",1447]
[null,"Caraş-Severin",1374]
[null,"Caraş-Severin",1160]
[null,"Caraş-Severin",2190]
[null,"Caraş-Severin",1224]
[null,"Cluj",1826]
[null,"Cluj",1836]
{"$rows_left_out":54}
{"sheet":"About","index":5,"n_rows":5,"n_cols":4,"rows_kept":5,"cut":false,"hidden":false,"merged":[]}
[]
[null,"The software is made available under the terms of the Creative Commons Attribution-ShareAlike 3.0 license. Copyright (c) 2010 by Randy Brooks."]
[]
[null,"Acknowledgment: ",null,"Special thanks to R. Mundigl for providing insight on the creation of Choropleth or Thematic maps in Excel."]
[null,"Mundigl, R. (2008, November 20). Build your own Choropleth Maps with Excel.  Retrieved from http://www.clearlyandsimply.com/clearly_and_simply/2009/08/build-your-own-choropleth-maps-with-excel.html"]